Page 2 of 3 FirstFirst 123 LastLast
Results 11 to 20 of 22

Thread: Config not loading

  1. #11
    Join Date
    May 2006
    Location
    Canada
    Posts
    29,170
    To use NFS to load the config file you still would need to compile the dongle. If you are looking at options with cygwin you could install a tftp server to serve dongle.bin.config

    Martin

  2. #12
    Join Date
    May 2008
    Location
    Pakistan
    Posts
    111
    Quote Originally Posted by mvallevand View Post
    To use NFS to load the config file you still would need to compile the dongle.
    I mean an NFS mounted share. In this case, I shouldnt be needing to compile the dongle.

    Quote Originally Posted by mvallevand View Post
    If you are looking at options with cygwin you could install a tftp server to serve dongle.bin.config
    Is there a howto about it?

    Thanks.

  3. #13
    Join Date
    May 2006
    Location
    Canada
    Posts
    29,170
    Sorry there is no how to on this other the stuff on the mvpmc wiki dealing with a real tftp server and I only support a guest share or any standard tftp server such as tftp32

    The login script will not attempt to mount an nfs drive, it uses a totally different syntax command syntax.

    Martin

  4. #14
    Join Date
    May 2008
    Location
    Pakistan
    Posts
    111
    I followed the instructions in the developer docs for Ubuntu, downloaded the packages and changed the rcS according to your instructions. But running make mvpmc gives an error. The last few lines are:
    make[4]: Leaving directory `/home/khurram/mvpmc/dongle/apps/djmount/mvp/djmount-0.71/djmount'
    make[3]: Leaving directory `/home/khurram/mvpmc/dongle/apps/djmount/mvp/djmount-0.71/djmount'
    make[3]: Entering directory `/home/khurram/mvpmc/dongle/apps/djmount/mvp/djmount-0.71'
    make[3]: Nothing to be done for `all-am'.
    make[3]: Leaving directory `/home/khurram/mvpmc/dongle/apps/djmount/mvp/djmount-0.71'
    make[2]: Leaving directory `/home/khurram/mvpmc/dongle/apps/djmount/mvp/djmount-0.71'
    make[1]: Leaving directory `/home/khurram/mvpmc/dongle/apps/djmount/mvp/djmount-0.71'
    make: *** [mvp] Error 2
    Btw, I sudo'd to root before running the first "git clone ...." command.

  5. #15
    Join Date
    May 2006
    Location
    Canada
    Posts
    29,170
    The command you want is

    make mvp

    Does that help?

    Martin

  6. #16
    Join Date
    May 2008
    Location
    Pakistan
    Posts
    111
    No, make mvp still gives an error but the last few lines are different:
    test -z "/home/khurram/mvpmc/dongle/install/mvp/include/tremor" || /bin/mkdir -p "/home/khurram/mvpmc/dongle/install/mvp/include/tremor"
    /usr/bin/install -c -m 644 'ivorbiscodec.h' '/home/khassan/mvpmc/dongle/install/mvp/include/tremor/ivorbiscodec.h'
    /usr/bin/install -c -m 644 'ivorbisfile.h' '/home/khurram/mvpmc/dongle/install/mvp/include/tremor/ivorbisfile.h'
    /usr/bin/install -c -m 644 'ogg.h' '/home/khurram/mvpmc/dongle/install/mvp/include/tremor/ogg.h'
    /usr/bin/install -c -m 644 'os_types.h' '/home/khurram/mvpmc/dongle/install/mvp/include/tremor/os_types.h'
    /usr/bin/install -c -m 644 'config_types.h' '/home/khurram/mvpmc/dongle/install/mvp/include/tremor/config_types.h'
    make[2]: Leaving directory `/home/khurram/mvpmc/dongle/libs/Tremor/mvp/Tremor'
    make[1]: Leaving directory `/home/khurram/mvpmc/dongle/libs/Tremor/mvp/Tremor'
    make: *** [mvp] Error 2

  7. #17
    Join Date
    May 2006
    Location
    Canada
    Posts
    29,170
    The git make is multi-tasking so the last lines will not necessarily show the real error. Redirect stderr to a file with syntax 2> filename and if you can't figure it out, zip and attach the file and I will have a look. You are probably missing one of the dependencies for the make like bison or yacc.

    Martin

  8. #18
    Join Date
    May 2008
    Location
    Pakistan
    Posts
    111
    I have redirect stderr to output.txt and looked it over. There seems to be some error about libupnp. There is a libupnp2 and libupnp2-dev and I installed both. But still get the following error:
    configure: WARNING: If you wanted to set the --build type, don't use --host.
    If a cross compiler is detected then cross compile mode will be used.
    /home/khurram/mvpmc/dongle/apps/busybox/mvp/busybox-1.1.3/coreutils/ls.c: In function `ls_main':
    /home/khurram/mvpmc/dongle/apps/busybox/mvp/busybox-1.1.3/coreutils/ls.c:1178: warning: implicit declaration of function `dfree'
    /home/khurram/mvpmc/dongle/apps/busybox/mvp/busybox-1.1.3/coreutils/stat.c: In function `do_stat':
    /home/khurram/mvpmc/dongle/apps/busybox/mvp/busybox-1.1.3/coreutils/stat.c:485: warning: long unsigned int format, different type arg (arg 3)
    /home/khurram/mvpmc/dongle/apps/busybox/mvp/busybox-1.1.3/coreutils/stat.c:485: warning: long unsigned int format, different type arg (arg 4)
    /home/khurram/mvpmc/dongle/apps/busybox/mvp/busybox-1.1.3/coreutils/stat.c:485: warning: long unsigned int format, different type arg (arg 8)
    /home/khurram/mvpmc/dongle/apps/busybox/mvp/busybox-1.1.3/coreutils/stat.c:485: warning: long unsigned int format, different type arg (arg 9)
    /home/khurram/mvpmc/dongle/apps/busybox/mvp/busybox-1.1.3/coreutils/stat.c:512: warning: long unsigned int format, different type arg (arg 2)
    /home/khurram/mvpmc/dongle/apps/busybox/mvp/busybox-1.1.3/coreutils/stat.c:512: warning: long unsigned int format, different type arg (arg 3)
    /home/khurram/mvpmc/dongle/apps/busybox/mvp/busybox-1.1.3/coreutils/stat.c:512: warning: long unsigned int format, different type arg (arg 6)
    /home/khurram/mvpmc/dongle/apps/busybox/mvp/busybox-1.1.3/coreutils/stat.c:512: warning: long unsigned int format, different type arg (arg 7)
    /home/khurram/mvpmc/dongle/apps/busybox/mvp/busybox-1.1.3/coreutils/stat.c:512: warning: long unsigned int format, different type arg (arg 8)
    /home/khurram/mvpmc/dongle/apps/busybox/mvp/busybox-1.1.3/modutils/rmmod.c: In function `rmmod_main':
    /home/khurram/mvpmc/dongle/apps/busybox/mvp/busybox-1.1.3/modutils/rmmod.c:89: warning: passing arg 3 of `my_query_module' from incompatible pointer type
    /home/khurram/mvpmc/dongle/apps/busybox/mvp/busybox-1.1.3/networking/ether-wake.c:247:3: warning: #warning Need to implement ether_hostton() for uClibc
    configure: WARNING: If you wanted to set the --build type, don't use --host.
    If a cross compiler is detected then cross compile mode will be used.
    /home/khurram/mvpmc/dongle/apps/busybox/mvp/busybox-1.1.3/util-linux/mount_cifs.c: In function `mount_cifs_main':
    /home/khurram/mvpmc/dongle/apps/busybox/mvp/busybox-1.1.3/util-linux/mount_cifs.c:653: warning: declaration of 'sysinfo' shadows a global declaration
    /home/khurram/mvpmc/dongle/apps/busybox/mvp/busybox-1.1.3/include/libbb.h:239: warning: shadowed declaration is here
    /bin/bash: libupnp/config.aux/config.rpath: No such file or directory
    configure: WARNING: If you wanted to set the --build type, don't use --host.
    If a cross compiler is detected then cross compile mode will be used.
    /home/khurram/mvpmc/dongle/apps/busybox/mvp/busybox-1.1.3/coreutils/coreutils.a(nohup.o): In function `close_stdout':
    /home/khurram/mvpmc/dongle/apps/busybox/mvp/busybox-1.1.3/coreutils/nohup.c:85: warning:
    flashcp.c:258:2: warning: #warning "Check for smaller erase regions"
    scons: *** [dongle/install/mvp/lib/libFLAC.a, dongle/install/mvp/include/FLAC/stream_decoder.h] None
    src/genlib/net/http/httpparser.c: In function `is_control_char':
    src/genlib/net/http/httpparser.c:182: warning: comparison is always true due to limited range of data type
    src/uuid/uuid.c: In function `uuid_create_from_name':
    src/uuid/uuid.c:307: warning: statement with no effect
    src/uuid/uuid.c:308: warning: statement with no effect
    src/uuid/uuid.c:309: warning: statement with no effect
    src/uuid/uuid.c:340: warning: statement with no effect
    src/uuid/uuid.c:341: warning: statement with no effect
    src/uuid/uuid.c:342: warning: statement with no effect
    make: *** [mvp] Error 2
    I cant figure it out. Can you please take a look?

    Thanks.

  9. #19
    Join Date
    May 2006
    Location
    Canada
    Posts
    29,170
    You shouldn't add any libraries to build mvpmc they get downloaded automatically.

    Martin

  10. #20
    Join Date
    May 2008
    Location
    Pakistan
    Posts
    111
    It downloaded a whole lot of stuff the first time I ran make mvp. But I keep on getting the error as in the post above.

Posting Permissions

  • You may not post new threads
  • You may not post replies
  • You may not post attachments
  • You may not edit your posts
  •